Missing file fmcomms3.xml

Description

When compiling for the ZedBoard, the compilation stops due to a missing xml file.

_Making compressed bit file: target-zynq/testbias_zed_gp1_use_gp1.bit.gz from target-zynq/testbias_zed_gp1_use_gp1.bit and target-zynq/testbias_zed_gp1_use_gp1-art.xml
For file gen/testbias_zed_base_fmcomms3_zed.xml: File "fmcomms3" could not be opened for reading/parsing. Files tried: gen/fmcomms3.xml, fmcomms3.xml, gen/fmcomms3.xml, /opt/opencpi/hdl/platforms/zed/lib/fmcomms3.xml, /opt/opencpi/hdl/platforms/zed/lib/hdl/fmcomms3.xml, ../fmcomms3.xml, ../gen/fmcomms3.xml, /opt/opencpi/prerequisites/ad9361/include/fmcomms3.xml, /opt/opencpi/components/lib/fmcomms3.xml, /opt/opencpi/components/lib/hdl/fmcomms3.xml, /opt/opencpi/exports/lib/components/fmcomms3.xml, /opt/opencpi/exports/lib/components/hdl/fmcomms3.xml, /opt/opencpi/hdl/adapters/lib/fmcomms3.xml, /opt/opencpi/hdl/adapters/lib/hdl/fmcomms3.xml, /opt/opencpi/exports/lib/adapters/fmcomms3.xml, /opt/opencpi/exports/lib/adapters/hdl/fmcomms3.xml, /opt/opencpi/exports/specs/fmcomms3.xml, ../../lib/xm/fmcomms3.xml, ../../lib/rcc/fmcomms3.xml, ../../lib/hdl/fmcomms3.xml, ../../lib/ocl/fmcomms3.xml, ../../lib/assy/fmcomms3.xml, ../../specs/fmcomms3.xml, ../../testbias/fmcomms3.xml, ../lib/xm/fmcomms3.xml, ../lib/rcc/fmcomms3.xml, ../lib/hdl/fmcomms3.xml, ../lib/ocl/fmcomms3.xml, ../lib/assy/fmcomms3.xml, ../specs/fmcomms3.xml, ../../testbias/lib/hdl/fmcomms3.xml, ../../testbias/lib/fmcomms3.xml, /opt/opencpi/hdl/devices/lib/hdl/fmcomms3.xml, /opt/opencpi/hdl/devices/lib/fmcomms3.xml, /opt/opencpi/exports/lib/devices/hdl/fmcomms3.xml, /opt/opencpi/exports/lib/devices/fmcomms3.xml, /opt/opencpi/hdl/cards/lib/hdl/fmcomms3.xml, /opt/opencpi/hdl/cards/lib/fmcomms3.xml, /opt/opencpi/exports/lib/cards/hdl/fmcomms3.xml, /opt/opencpi/exports/lib/cards/fmcomms3.xml. CWD is /opt/opencpi/hdl/assemblies/testbias/container-testbias_zed_base_fmcomms3_zed
/opt/opencpi/exports/include/hdl/hdl-container.mk:104: *** Failed to process initial parameters for this worker: 1. Stop.
make[4]: *** [container-testbias_zed_base_fmcomms3_zed/target-zynq/testbias_zed_base_fmcomms3_zed.bitz] Error 2
make[3]: *** [vivado] Error 2
make[2]: *** [testbias] Error 2
make[1]: *** [assemblies] Error 2
make[1]: Leaving directory `/opt/opencpi/hdl'
make: *** [hdl] Error 2
_

Environment

OpenCPI-2017.Q2.0

Status

Assignee

Unassigned

Reporter

OpenCPI Guest

Labels

None

Components

Priority

Blocker